{"text_format":"1","workbook":"xlsx","n_sheets":3,"sheets":["Instructions","Lists","Dispute Entry Form"],"not_rendered":{"charts":0,"images":1,"macros":1,"external_links":0,"defined_names":0,"comments":0,"pivot_tables":0},"unopened":[],"bounds":{"document_bytes":16777216,"sheet_cells":100000,"rows_first":2000,"rows_last":500,"rows_between":2000,"halvings":0,"cell_chars":16384,"cell_head_chars":4096},"cells_cut":0,"cells_raw":0,"read":"whole","date_system":"1900"}

{"sheet":"Instructions","index":0,"n_rows":69,"n_cols":3,"rows_kept":69,"cut":false,"hidden":false,"merged":[[58,1,58,2],[66,1,66,2],[53,1,53,2],[5,1,5,2],[14,1,14,2],[25,1,25,2],[48,1,48,2],[1,1,1,2],[2,1,2,2],[4,1,4,2],[31,1,31,2],[41,1,41,2]]}
[]
[null,"UPS International Shipping Dispute Intake Form - Instructions"]
[null,"Purpose"]
[null,"Purpose","This form is used to request a review of an international shipping invoice when an error is suspected. Providing complete and accurate information helps UPS process the dispute quickly and minimize follow-up."]
[null,"Step-by-Step Instructions"]
[null,"Step 1:  Contact Information"]
[null,"Contact Name","Enter the name of the person UPS should reach for questions."]
[null,"Contact Address","Provide the full street address, city, state, and ZIP code."]
[null,"Contact Phone Number","Include a direct phone number."]
[null,"Contact Email Address","Enter an email address for communication."]
[null,"Business Name","Enter the legal name of the company."]
[null,"UPS Account Number","Provide the UPS account number associated with the shipment."]
[null,"Billing Tax ID","Enter the tax identification number used for billing."]
[null,"Dispute Entry Date","Enter the date the dispute is being submitted."]
[null,"Step 2:  Shipment Information"]
[null,"Record #","Shipment record identifier.  For more than one shipment, please just increment by 1 (1, 2, 3....)."]
[null,"Shipment Number / 1Z","Enter the UPS shipment identifier (1Z)."]
[null,"Entry Number(s) / SCS Number","Enter the U.S. Customs entry number for the shipment (SCSxxxxxxx)."]
[null,"Date of Import","Provide the date the goods entered the U.S."]
[null,"Invoice Number(s)","Enter the invoice number(s) being disputed."]
[null,"Shipment Value","Enter the total value of the shipment as declared at entry."]
[null,"Disputed Value","Enter the amount being disputed."]
[null,"Dispute Type","Select the type of dispute (see definitions below)."]
[null,"Checklist for Required Documentation","A document listing of required substantiation for the selected dispute type (informational only)"]
[null,"Dispute Reasoning","Provide a detailed explanation of why the invoice is incorrect. Include any relevant facts or supporting details."]
[null,"Step 3:  Save and Email Dispute Form"]
[null,"File Naming Standard","Save the completed form using this format: Dispute_<EntryNumber>_<DateYYYYMMDD>.xlsx. Example: Dispute_12345678_20251204.xlsx. This ensures uniqueness and prevents duplicate names."]
[null,"Email Address","Send the completed form and all required documents to: gbapostentrydesk@ups.com."]
[null,"Subject Line","Use this subject line for the email: 'International Dispute Submission - Entry <EntryNumber>'. Example: International Dispute Submission - Entry SCS1234567."]
[null,"Attachments","Attach the completed Post Entry dispute form and all supporting substantiation documentation required for the selected dispute type to the email. Ensure files are clearly named and legible."]
[null,"Email Body","Include a brief note stating that the dispute form and supporting documents are attached for review."]
[null,"Dispute Types & Definitions"]
[null,"USMCA","Dispute related to claiming preferential duty under the U.S.-Mexico-Canada Agreement."]
[null,"Steel & Aluminum","Dispute related to tariffs or duty rates on steel or aluminum products."]
[null,"Copper","Dispute related to tariffs or duty rates on copper products."]
[null,"Classification","Dispute regarding the Harmonized Tariff Schedule (HTS) code assigned to the product."]
[null,"IOR Change","Request to change the Importer of Record (legal entity responsible for the import)."]
[null,"Consignee Change","Request to change the consignee (recipient of goods)."]
[null,"Free Trade Agreement (FTA)","Dispute related to claiming preferential duty under an FTA other than USMCA."]
[null,"Valuation","Dispute regarding the declared value of goods for duty calculation."]
[null,"Other","Any dispute not covered by the above categories."]
[null,"Required Documentation"]
[null,"USMCA","USMCA Certificate, Certificate of Origin, 10-Element Data Form (only for FTAs other than USMCA)."]
[null,"Steel & Aluminum / Copper / Classification","Product literature, Product spec sheets or color photos."]
[null,"IOR Change / Consignee Change","Letter of authorization (tax ID, contact info, signature of new IOR/consignee)."]
[null,"Free Trade Agreement (non-USMCA)","Certificate of Origin, 10-Element Data Form."]
[null,"Valuation","Proof of payment, Voided check/wire transfer/bank statement, Revised invoice if value differs."]
[null,"Other","A UPS representative will be in contact to request any appropriate documentation"]
[null,"Definitions for Technical Terms"]
[null,"Entry Number","A unique number assigned by U.S. Customs to identify an import entry."]
[null,"Importer of Record (IOR)","The party legally responsible for ensuring goods comply with customs regulations and paying duties."]
[null,"Liquidation Date","The date U.S. Customs finalizes the entry and duty amount (usually within 314 days of import)."]
[null,"FTA","Free Trade Agreement, which may allow reduced or zero duty rates if eligibility criteria are met."]
[null,"Tips to Avoid Delays"]
[null,"Provide complete and accurate information","Ensure all fields are filled correctly."]
[null,"Attach all required documents","Include all documents for the selected dispute type."]
[null,"Submit within allowed timeframe","PSC before liquidation (usually within 314 days of import), Protest within 180 days after liquidation."]
[null,"Use clear reasoning","Provide detailed explanation for the dispute."]
[null,"Dispute Guidlines and Fees"]
[null,"If the dispute is determined to be due to customer error, the following fees will apply:"]
{"$rows_left_out":10}
{"sheet":"Lists","index":1,"n_rows":32,"n_cols":10,"rows_kept":32,"cut":false,"hidden":true,"merged":[]}
["Dispute Types",null,null,"Required Documents"]
["USMCA",null,null,"1.  USMCA     \n2.  Certificate of Origin     \n3.  10 element Data Form should only be used for FTA that are NOT USMCA"]
["Steel & Aluminum",null,null,"1. Product literature\n2. Product spec sheets or color photos"]
["Copper",null,null,"1. Product literature \n2. Product spec sheets or color photos"]
["Classification",null,null,"1. Product literature \n2. Product spec sheets or color photos"]
["IOR Change",null,null,"1. Letter of authorization (tax id, point of contact, and signature of new IOR)"]
["Consignee Change",null,null,"1. Letter of authorization (tax id, point of contact, and signature of new IOR)"]
["Free Trade Agreement",null,null,"1. USMCA \n2. Certificate of origin\n3. 10 element data form should only be used for FTA that are NOT USMCA"]
["Valuation",null,null,"1. Proof of payment\n2. Voided check, wire transfer, bank statement\n3. Revised invoice if value differs from the commercial invoice at entry"]
["Other",null,null,"None"]
[]
[]
[]
[]
[]
[]
[]
[]
[]
[]
[]
[]
[]
[]
[]
[]
[]
[]
[]
[]
[]
[null,null,null,null,null,null,null,null,null,{"$f":"_xlfn.IFS(C32=Lists!A2, \"\", TRUE, \"\")","v":""}]

{"sheet":"Dispute Entry Form","index":2,"n_rows":1018,"n_cols":9,"rows_kept":1018,"cut":false,"hidden":false,"merged":[[7,7,9,8],[14,0,15,8],[0,0,5,8],[11,0,11,1],[12,0,12,1],[10,0,10,1],[9,0,9,1],[9,2,9,3],[10,2,10,3],[11,2,11,3],[12,2,12,3],[9,5,9,6],[10,5,10,6],[11,5,11,6],[12,5,12,6],[7,0,8,6]]}
["          Post Entry Dispute Form | For instructions and definitions please visit the Instructions tab."]
[]
[]
[]
[]
[]
[]
[" Contact Information",null,null,null,null,null,null,"**Important - Please Note**\n\nIncomplete or inaccurate information - or missing documentation - may cause delays or lead to your dispute being closed. Ensure all fields are filled and required documents are attached before sending."]
[]
["  Contact Name",null,null,null,"  Dispute Entry Date"]
["  Contact Address\n  Street, City, State Zip",null," ",null,"  Buisiness Name"," "]
["  Contact Phone Number",null," ",null,"  UPS Account Number"," "]
["  Contact Email Address",null," ",null,"  Billing Tax ID"]
[null,null,null," "]
["Shipment(s) Information"]
[]
["Record #","Shipment ID / 1Z number","Entry Number\n(SCSxxxxxxx)","Date of Import","Invoice Number","Disputed Value","Select Dispute Type","Checklist for Required Documentation","Dispute Reasoning (Please be as detailed as possible)"]
["EXAMPLE\n0","1Z9106234","SCS81963120","2026-12-05",123456,250,"Classification",{"$f":"_xlfn.IFS(G18=Lists!$A$2, Lists!$D$2, G18=Lists!$A$3, Lists!$D$3, G18=Lists!$A$4, Lists!$D$4, G18=Lists!$A$5, Lists!$D$5,G18=Lists!$A$6, Lists!$D$6, G18=Lists!$A$7, Lists!$D$7, G18=Lists!$A$8, Lists!$D$8, G18=Lists!$A$9, Lists!$D$9, G18=Lists!$A$10, Lists!$D$10, TRUE, \"\")","v":"1. Product literature \n2. Product spec sheets or color photos"},"My package was accidentally mislabeled as having aluminum and was assigned the wrong duty class. If you Google the \"Forza Pro Football Target Sheet\", you will see that it's a cloth/mesh cover that attaches to a goal via velcro strips. Duty class 9903.85.68 refers to aluminum, which my package contains none of."]
[1,null,null,null,null,null,null,{"$f":"_xlfn.IFS(G19=Lists!$A$2, Lists!$D$2, G19=Lists!$A$3, Lists!$D$3, G19=Lists!$A$4, Lists!$D$4, G19=Lists!$A$5, Lists!$D$5,G19=Lists!$A$6, Lists!$D$6, G19=Lists!$A$7, Lists!$D$7, G19=Lists!$A$8, Lists!$D$8, G19=Lists!$A$9, Lists!$D$9, G19=Lists!$A$10, Lists!$D$10, TRUE, \"\")","v":""}]
[2,null,null,null,null,null,null,{"$f":"_xlfn.IFS(G20=Lists!$A$2, Lists!$D$2, G20=Lists!$A$3, Lists!$D$3, G20=Lists!$A$4, Lists!$D$4, G20=Lists!$A$5, Lists!$D$5,G20=Lists!$A$6, Lists!$D$6, G20=Lists!$A$7, Lists!$D$7, G20=Lists!$A$8, Lists!$D$8, G20=Lists!$A$9, Lists!$D$9, G20=Lists!$A$10, Lists!$D$10, TRUE, \"\")","v":""}]
[3,null,null,null,null,null,null,{"$f":"_xlfn.IFS(G21=Lists!$A$2, Lists!$D$2, G21=Lists!$A$3, Lists!$D$3, G21=Lists!$A$4, Lists!$D$4, G21=Lists!$A$5, Lists!$D$5,G21=Lists!$A$6, Lists!$D$6, G21=Lists!$A$7, Lists!$D$7, G21=Lists!$A$8, Lists!$D$8, G21=Lists!$A$9, Lists!$D$9, G21=Lists!$A$10, Lists!$D$10, TRUE, \"\")","v":""}]
[4,null,null,null,null,null,null,{"$f":"_xlfn.IFS(G22=Lists!$A$2, Lists!$D$2, G22=Lists!$A$3, Lists!$D$3, G22=Lists!$A$4, Lists!$D$4, G22=Lists!$A$5, Lists!$D$5,G22=Lists!$A$6, Lists!$D$6, G22=Lists!$A$7, Lists!$D$7, G22=Lists!$A$8, Lists!$D$8, G22=Lists!$A$9, Lists!$D$9, G22=Lists!$A$10, Lists!$D$10, TRUE, \"\")","v":""}]
[5,null,null,null,null,null,null,{"$f":"_xlfn.IFS(G23=Lists!$A$2, Lists!$D$2, G23=Lists!$A$3, Lists!$D$3, G23=Lists!$A$4, Lists!$D$4, G23=Lists!$A$5, Lists!$D$5,G23=Lists!$A$6, Lists!$D$6, G23=Lists!$A$7, Lists!$D$7, G23=Lists!$A$8, Lists!$D$8, G23=Lists!$A$9, Lists!$D$9, G23=Lists!$A$10, Lists!$D$10, TRUE, \"\")","v":""}]
[6,null,null,null,null,null,null,{"$f":"_xlfn.IFS(G24=Lists!$A$2, Lists!$D$2, G24=Lists!$A$3, Lists!$D$3, G24=Lists!$A$4, Lists!$D$4, G24=Lists!$A$5, Lists!$D$5,G24=Lists!$A$6, Lists!$D$6, G24=Lists!$A$7, Lists!$D$7, G24=Lists!$A$8, Lists!$D$8, G24=Lists!$A$9, Lists!$D$9, G24=Lists!$A$10, Lists!$D$10, TRUE, \"\")","v":""}]
[7,null,null,null,null,null,null,{"$f":"_xlfn.IFS(G25=Lists!$A$2, Lists!$D$2, G25=Lists!$A$3, Lists!$D$3, G25=Lists!$A$4, Lists!$D$4, G25=Lists!$A$5, Lists!$D$5,G25=Lists!$A$6, Lists!$D$6, G25=Lists!$A$7, Lists!$D$7, G25=Lists!$A$8, Lists!$D$8, G25=Lists!$A$9, Lists!$D$9, G25=Lists!$A$10, Lists!$D$10, TRUE, \"\")","v":""}]
[8,null,null,null,null,null,null,{"$f":"_xlfn.IFS(G26=Lists!$A$2, Lists!$D$2, G26=Lists!$A$3, Lists!$D$3, G26=Lists!$A$4, Lists!$D$4, G26=Lists!$A$5, Lists!$D$5,G26=Lists!$A$6, Lists!$D$6, G26=Lists!$A$7, Lists!$D$7, G26=Lists!$A$8, Lists!$D$8, G26=Lists!$A$9, Lists!$D$9, G26=Lists!$A$10, Lists!$D$10, TRUE, \"\")","v":""}]
[9,null,null,null,null,null,null,{"$f":"_xlfn.IFS(G27=Lists!$A$2, Lists!$D$2, G27=Lists!$A$3, Lists!$D$3, G27=Lists!$A$4, Lists!$D$4, G27=Lists!$A$5, Lists!$D$5,G27=Lists!$A$6, Lists!$D$6, G27=Lists!$A$7, Lists!$D$7, G27=Lists!$A$8, Lists!$D$8, G27=Lists!$A$9, Lists!$D$9, G27=Lists!$A$10, Lists!$D$10, TRUE, \"\")","v":""}]
[10,null,null,null,null,null,null,{"$f":"_xlfn.IFS(G28=Lists!$A$2, Lists!$D$2, G28=Lists!$A$3, Lists!$D$3, G28=Lists!$A$4, Lists!$D$4, G28=Lists!$A$5, Lists!$D$5,G28=Lists!$A$6, Lists!$D$6, G28=Lists!$A$7, Lists!$D$7, G28=Lists!$A$8, Lists!$D$8, G28=Lists!$A$9, Lists!$D$9, G28=Lists!$A$10, Lists!$D$10, TRUE, \"\")","v":""}]
[11,null,null,null,null,null,null,{"$f":"_xlfn.IFS(G29=Lists!$A$2, Lists!$D$2, G29=Lists!$A$3, Lists!$D$3, G29=Lists!$A$4, Lists!$D$4, G29=Lists!$A$5, Lists!$D$5,G29=Lists!$A$6, Lists!$D$6, G29=Lists!$A$7, Lists!$D$7, G29=Lists!$A$8, Lists!$D$8, G29=Lists!$A$9, Lists!$D$9, G29=Lists!$A$10, Lists!$D$10, TRUE, \"\")","v":""}]
[12,null,null,null,null,null,null,{"$f":"_xlfn.IFS(G30=Lists!$A$2, Lists!$D$2, G30=Lists!$A$3, Lists!$D$3, G30=Lists!$A$4, Lists!$D$4, G30=Lists!$A$5, Lists!$D$5,G30=Lists!$A$6, Lists!$D$6, G30=Lists!$A$7, Lists!$D$7, G30=Lists!$A$8, Lists!$D$8, G30=Lists!$A$9, Lists!$D$9, G30=Lists!$A$10, Lists!$D$10, TRUE, \"\")","v":""}]
[13,null,null,null,null,null,null,{"$f":"_xlfn.IFS(G31=Lists!$A$2, Lists!$D$2, G31=Lists!$A$3, Lists!$D$3, G31=Lists!$A$4, Lists!$D$4, G31=Lists!$A$5, Lists!$D$5,G31=Lists!$A$6, Lists!$D$6, G31=Lists!$A$7, Lists!$D$7, G31=Lists!$A$8, Lists!$D$8, G31=Lists!$A$9, Lists!$D$9, G31=Lists!$A$10, Lists!$D$10, TRUE, \"\")","v":""}]
[14,null,null,null,null,null,null,{"$f":"_xlfn.IFS(G32=Lists!$A$2, Lists!$D$2, G32=Lists!$A$3, Lists!$D$3, G32=Lists!$A$4, Lists!$D$4, G32=Lists!$A$5, Lists!$D$5,G32=Lists!$A$6, Lists!$D$6, G32=Lists!$A$7, Lists!$D$7, G32=Lists!$A$8, Lists!$D$8, G32=Lists!$A$9, Lists!$D$9, G32=Lists!$A$10, Lists!$D$10, TRUE, \"\")","v":""}]
[15,null,null,null,null,null,null,{"$f":"_xlfn.IFS(G33=Lists!$A$2, Lists!$D$2, G33=Lists!$A$3, Lists!$D$3, G33=Lists!$A$4, Lists!$D$4, G33=Lists!$A$5, Lists!$D$5,G33=Lists!$A$6, Lists!$D$6, G33=Lists!$A$7, Lists!$D$7, G33=Lists!$A$8, Lists!$D$8, G33=Lists!$A$9, Lists!$D$9, G33=Lists!$A$10, Lists!$D$10, TRUE, \"\")","v":""}]
[16,null,null,null,null,null,null,{"$f":"_xlfn.IFS(G34=Lists!$A$2, Lists!$D$2, G34=Lists!$A$3, Lists!$D$3, G34=Lists!$A$4, Lists!$D$4, G34=Lists!$A$5, Lists!$D$5,G34=Lists!$A$6, Lists!$D$6, G34=Lists!$A$7, Lists!$D$7, G34=Lists!$A$8, Lists!$D$8, G34=Lists!$A$9, Lists!$D$9, G34=Lists!$A$10, Lists!$D$10, TRUE, \"\")","v":""}]
[17,null,null,null,null,null,null,{"$f":"_xlfn.IFS(G35=Lists!$A$2, Lists!$D$2, G35=Lists!$A$3, Lists!$D$3, G35=Lists!$A$4, Lists!$D$4, G35=Lists!$A$5, Lists!$D$5,G35=Lists!$A$6, Lists!$D$6, G35=Lists!$A$7, Lists!$D$7, G35=Lists!$A$8, Lists!$D$8, G35=Lists!$A$9, Lists!$D$9, G35=Lists!$A$10, Lists!$D$10, TRUE, \"\")","v":""}]
[18,null,null,null,null,null,null,{"$f":"_xlfn.IFS(G36=Lists!$A$2, Lists!$D$2, G36=Lists!$A$3, Lists!$D$3, G36=Lists!$A$4, Lists!$D$4, G36=Lists!$A$5, Lists!$D$5,G36=Lists!$A$6, Lists!$D$6, G36=Lists!$A$7, Lists!$D$7, G36=Lists!$A$8, Lists!$D$8, G36=Lists!$A$9, Lists!$D$9, G36=Lists!$A$10, Lists!$D$10, TRUE, \"\")","v":""}]
[19,null,null,null,null,null,null,{"$f":"_xlfn.IFS(G37=Lists!$A$2, Lists!$D$2, G37=Lists!$A$3, Lists!$D$3, G37=Lists!$A$4, Lists!$D$4, G37=Lists!$A$5, Lists!$D$5,G37=Lists!$A$6, Lists!$D$6, G37=Lists!$A$7, Lists!$D$7, G37=Lists!$A$8, Lists!$D$8, G37=Lists!$A$9, Lists!$D$9, G37=Lists!$A$10, Lists!$D$10, TRUE, \"\")","v":""}]
[20,null,null,null,null,null,null,{"$f":"_xlfn.IFS(G38=Lists!$A$2, Lists!$D$2, G38=Lists!$A$3, Lists!$D$3, G38=Lists!$A$4, Lists!$D$4, G38=Lists!$A$5, Lists!$D$5,G38=Lists!$A$6, Lists!$D$6, G38=Lists!$A$7, Lists!$D$7, G38=Lists!$A$8, Lists!$D$8, G38=Lists!$A$9, Lists!$D$9, G38=Lists!$A$10, Lists!$D$10, TRUE, \"\")","v":""}]
[21,null,null,null,null,null,null,{"$f":"_xlfn.IFS(G39=Lists!$A$2, Lists!$D$2, G39=Lists!$A$3, Lists!$D$3, G39=Lists!$A$4, Lists!$D$4, G39=Lists!$A$5, Lists!$D$5,G39=Lists!$A$6, Lists!$D$6, G39=Lists!$A$7, Lists!$D$7, G39=Lists!$A$8, Lists!$D$8, G39=Lists!$A$9, Lists!$D$9, G39=Lists!$A$10, Lists!$D$10, TRUE, \"\")","v":""}]
[22,null,null,null,null,null,null,{"$f":"_xlfn.IFS(G40=Lists!$A$2, Lists!$D$2, G40=Lists!$A$3, Lists!$D$3, G40=Lists!$A$4, Lists!$D$4, G40=Lists!$A$5, Lists!$D$5,G40=Lists!$A$6, Lists!$D$6, G40=Lists!$A$7, Lists!$D$7, G40=Lists!$A$8, Lists!$D$8, G40=Lists!$A$9, Lists!$D$9, G40=Lists!$A$10, Lists!$D$10, TRUE, \"\")","v":""}]
[23,null,null,null,null,null,null,{"$f":"_xlfn.IFS(G41=Lists!$A$2, Lists!$D$2, G41=Lists!$A$3, Lists!$D$3, G41=Lists!$A$4, Lists!$D$4, G41=Lists!$A$5, Lists!$D$5,G41=Lists!$A$6, Lists!$D$6, G41=Lists!$A$7, Lists!$D$7, G41=Lists!$A$8, Lists!$D$8, G41=Lists!$A$9, Lists!$D$9, G41=Lists!$A$10, Lists!$D$10, TRUE, \"\")","v":""}]
[24,null,null,null,null,null,null,{"$f":"_xlfn.IFS(G42=Lists!$A$2, Lists!$D$2, G42=Lists!$A$3, Lists!$D$3, G42=Lists!$A$4, Lists!$D$4, G42=Lists!$A$5, Lists!$D$5,G42=Lists!$A$6, Lists!$D$6, G42=Lists!$A$7, Lists!$D$7, G42=Lists!$A$8, Lists!$D$8, G42=Lists!$A$9, Lists!$D$9, G42=Lists!$A$10, Lists!$D$10, TRUE, \"\")","v":""}]
[25,null,null,null,null,null,null,{"$f":"_xlfn.IFS(G43=Lists!$A$2, Lists!$D$2, G43=Lists!$A$3, Lists!$D$3, G43=Lists!$A$4, Lists!$D$4, G43=Lists!$A$5, Lists!$D$5,G43=Lists!$A$6, Lists!$D$6, G43=Lists!$A$7, Lists!$D$7, G43=Lists!$A$8, Lists!$D$8, G43=Lists!$A$9, Lists!$D$9, G43=Lists!$A$10, Lists!$D$10, TRUE, \"\")","v":""}]
[26,null,null,null,null,null,null,{"$f":"_xlfn.IFS(G44=Lists!$A$2, Lists!$D$2, G44=Lists!$A$3, Lists!$D$3, G44=Lists!$A$4, Lists!$D$4, G44=Lists!$A$5, Lists!$D$5,G44=Lists!$A$6, Lists!$D$6, G44=Lists!$A$7, Lists!$D$7, G44=Lists!$A$8, Lists!$D$8, G44=Lists!$A$9, Lists!$D$9, G44=Lists!$A$10, Lists!$D$10, TRUE, \"\")","v":""}]
[27,null,null,null,null,null,null,{"$f":"_xlfn.IFS(G45=Lists!$A$2, Lists!$D$2, G45=Lists!$A$3, Lists!$D$3, G45=Lists!$A$4, Lists!$D$4, G45=Lists!$A$5, Lists!$D$5,G45=Lists!$A$6, Lists!$D$6, G45=Lists!$A$7, Lists!$D$7, G45=Lists!$A$8, Lists!$D$8, G45=Lists!$A$9, Lists!$D$9, G45=Lists!$A$10, Lists!$D$10, TRUE, \"\")","v":""}]
[28,null,null,null,null,null,null,{"$f":"_xlfn.IFS(G46=Lists!$A$2, Lists!$D$2, G46=Lists!$A$3, Lists!$D$3, G46=Lists!$A$4, Lists!$D$4, G46=Lists!$A$5, Lists!$D$5,G46=Lists!$A$6, Lists!$D$6, G46=Lists!$A$7, Lists!$D$7, G46=Lists!$A$8, Lists!$D$8, G46=Lists!$A$9, Lists!$D$9, G46=Lists!$A$10, Lists!$D$10, TRUE, \"\")","v":""}]
[29,null,null,null,null,null,null,{"$f":"_xlfn.IFS(G47=Lists!$A$2, Lists!$D$2, G47=Lists!$A$3, Lists!$D$3, G47=Lists!$A$4, Lists!$D$4, G47=Lists!$A$5, Lists!$D$5,G47=Lists!$A$6, Lists!$D$6, G47=Lists!$A$7, Lists!$D$7, G47=Lists!$A$8, Lists!$D$8, G47=Lists!$A$9, Lists!$D$9, G47=Lists!$A$10, Lists!$D$10, TRUE, \"\")","v":""}]
[30,null,null,null,null,null,null,{"$f":"_xlfn.IFS(G48=Lists!$A$2, Lists!$D$2, G48=Lists!$A$3, Lists!$D$3, G48=Lists!$A$4, Lists!$D$4, G48=Lists!$A$5, Lists!$D$5,G48=Lists!$A$6, Lists!$D$6, G48=Lists!$A$7, Lists!$D$7, G48=Lists!$A$8, Lists!$D$8, G48=Lists!$A$9, Lists!$D$9, G48=Lists!$A$10, Lists!$D$10, TRUE, \"\")","v":""}]
[31,null,null,null,null,null,null,{"$f":"_xlfn.IFS(G49=Lists!$A$2, Lists!$D$2, G49=Lists!$A$3, Lists!$D$3, G49=Lists!$A$4, Lists!$D$4, G49=Lists!$A$5, Lists!$D$5,G49=Lists!$A$6, Lists!$D$6, G49=Lists!$A$7, Lists!$D$7, G49=Lists!$A$8, Lists!$D$8, G49=Lists!$A$9, Lists!$D$9, G49=Lists!$A$10, Lists!$D$10, TRUE, \"\")","v":""}]
[32,null,null,null,null,null,null,{"$f":"_xlfn.IFS(G50=Lists!$A$2, Lists!$D$2, G50=Lists!$A$3, Lists!$D$3, G50=Lists!$A$4, Lists!$D$4, G50=Lists!$A$5, Lists!$D$5,G50=Lists!$A$6, Lists!$D$6, G50=Lists!$A$7, Lists!$D$7, G50=Lists!$A$8, Lists!$D$8, G50=Lists!$A$9, Lists!$D$9, G50=Lists!$A$10, Lists!$D$10, TRUE, \"\")","v":""}]
[33,null,null,null,null,null,null,{"$f":"_xlfn.IFS(G51=Lists!$A$2, Lists!$D$2, G51=Lists!$A$3, Lists!$D$3, G51=Lists!$A$4, Lists!$D$4, G51=Lists!$A$5, Lists!$D$5,G51=Lists!$A$6, Lists!$D$6, G51=Lists!$A$7, Lists!$D$7, G51=Lists!$A$8, Lists!$D$8, G51=Lists!$A$9, Lists!$D$9, G51=Lists!$A$10, Lists!$D$10, TRUE, \"\")","v":""}]
[34,null,null,null,null,null,null,{"$f":"_xlfn.IFS(G52=Lists!$A$2, Lists!$D$2, G52=Lists!$A$3, Lists!$D$3, G52=Lists!$A$4, Lists!$D$4, G52=Lists!$A$5, Lists!$D$5,G52=Lists!$A$6, Lists!$D$6, G52=Lists!$A$7, Lists!$D$7, G52=Lists!$A$8, Lists!$D$8, G52=Lists!$A$9, Lists!$D$9, G52=Lists!$A$10, Lists!$D$10, TRUE, \"\")","v":""}]
[35,null,null,null,null,null,null,{"$f":"_xlfn.IFS(G53=Lists!$A$2, Lists!$D$2, G53=Lists!$A$3, Lists!$D$3, G53=Lists!$A$4, Lists!$D$4, G53=Lists!$A$5, Lists!$D$5,G53=Lists!$A$6, Lists!$D$6, G53=Lists!$A$7, Lists!$D$7, G53=Lists!$A$8, Lists!$D$8, G53=Lists!$A$9, Lists!$D$9, G53=Lists!$A$10, Lists!$D$10, TRUE, \"\")","v":""}]
[36,null,null,null,null,null,null,{"$f":"_xlfn.IFS(G54=Lists!$A$2, Lists!$D$2, G54=Lists!$A$3, Lists!$D$3, G54=Lists!$A$4, Lists!$D$4, G54=Lists!$A$5, Lists!$D$5,G54=Lists!$A$6, Lists!$D$6, G54=Lists!$A$7, Lists!$D$7, G54=Lists!$A$8, Lists!$D$8, G54=Lists!$A$9, Lists!$D$9, G54=Lists!$A$10, Lists!$D$10, TRUE, \"\")","v":""}]
[37,null,null,null,null,null,null,{"$f":"_xlfn.IFS(G55=Lists!$A$2, Lists!$D$2, G55=Lists!$A$3, Lists!$D$3, G55=Lists!$A$4, Lists!$D$4, G55=Lists!$A$5, Lists!$D$5,G55=Lists!$A$6, Lists!$D$6, G55=Lists!$A$7, Lists!$D$7, G55=Lists!$A$8, Lists!$D$8, G55=Lists!$A$9, Lists!$D$9, G55=Lists!$A$10, Lists!$D$10, TRUE, \"\")","v":""}]
[38,null,null,null,null,null,null,{"$f":"_xlfn.IFS(G56=Lists!$A$2, Lists!$D$2, G56=Lists!$A$3, Lists!$D$3, G56=Lists!$A$4, Lists!$D$4, G56=Lists!$A$5, Lists!$D$5,G56=Lists!$A$6, Lists!$D$6, G56=Lists!$A$7, Lists!$D$7, G56=Lists!$A$8, Lists!$D$8, G56=Lists!$A$9, Lists!$D$9, G56=Lists!$A$10, Lists!$D$10, TRUE, \"\")","v":""}]
[39,null,null,null,null,null,null,{"$f":"_xlfn.IFS(G57=Lists!$A$2, Lists!$D$2, G57=Lists!$A$3, Lists!$D$3, G57=Lists!$A$4, Lists!$D$4, G57=Lists!$A$5, Lists!$D$5,G57=Lists!$A$6, Lists!$D$6, G57=Lists!$A$7, Lists!$D$7, G57=Lists!$A$8, Lists!$D$8, G57=Lists!$A$9, Lists!$D$9, G57=Lists!$A$10, Lists!$D$10, TRUE, \"\")","v":""}]
[40,null,null,null,null,null,null,{"$f":"_xlfn.IFS(G58=Lists!$A$2, Lists!$D$2, G58=Lists!$A$3, Lists!$D$3, G58=Lists!$A$4, Lists!$D$4, G58=Lists!$A$5, Lists!$D$5,G58=Lists!$A$6, Lists!$D$6, G58=Lists!$A$7, Lists!$D$7, G58=Lists!$A$8, Lists!$D$8, G58=Lists!$A$9, Lists!$D$9, G58=Lists!$A$10, Lists!$D$10, TRUE, \"\")","v":""}]
[41,null,null,null,null,null,null,{"$f":"_xlfn.IFS(G59=Lists!$A$2, Lists!$D$2, G59=Lists!$A$3, Lists!$D$3, G59=Lists!$A$4, Lists!$D$4, G59=Lists!$A$5, Lists!$D$5,G59=Lists!$A$6, Lists!$D$6, G59=Lists!$A$7, Lists!$D$7, G59=Lists!$A$8, Lists!$D$8, G59=Lists!$A$9, Lists!$D$9, G59=Lists!$A$10, Lists!$D$10, TRUE, \"\")","v":""}]
[42,null,null,null,null,null,null,{"$f":"_xlfn.IFS(G60=Lists!$A$2, Lists!$D$2, G60=Lists!$A$3, Lists!$D$3, G60=Lists!$A$4, Lists!$D$4, G60=Lists!$A$5, Lists!$D$5,G60=Lists!$A$6, Lists!$D$6, G60=Lists!$A$7, Lists!$D$7, G60=Lists!$A$8, Lists!$D$8, G60=Lists!$A$9, Lists!$D$9, G60=Lists!$A$10, Lists!$D$10, TRUE, \"\")","v":""}]
{"$rows_left_out":958}